{"text_format":"1","workbook":"xlsx","n_sheets":7,"sheets":["Version","RefState","Template9090","Map9090","ByWIB","ByState","ETA9090"],"not_rendered":{"charts":0,"images":0,"macros":1,"external_links":0,"defined_names":1,"comments":0,"pivot_tables":0},"unopened":[],"bounds":{"document_bytes":16777216,"sheet_cells":100000,"rows_first":2000,"rows_last":500,"rows_between":2000,"halvings":0,"cell_chars":16384,"cell_head_chars":4096},"cells_cut":0,"cells_raw":0,"read":"whole","date_system":"1900"}

{"sheet":"Version","index":0,"n_rows":3,"n_cols":3,"rows_kept":3,"cut":false,"hidden":true,"merged":[]}
["Version Number","Date","State"]
[1,"2013-12-16","Initial Version"]
[2,"2013-12-19","State and Local Data Preloaded"]

{"sheet":"RefState","index":1,"n_rows":62,"n_cols":3,"rows_kept":62,"cut":false,"hidden":true,"merged":[]}
["STATE_NAME","STATE_ABBREVIATION_SRC","REGION_ID_SRC"]
["Alabama","AL",3]
["Alaska","AK",6]
["American Samoa","AS",6]
["Arizona","AZ",6]
["Arkansas","AR",4]
["California","CA",6]
["Colorado","CO",4]
["Connecticut","CT",1]
["Delaware","DE",2]
{"$rows_left_out":53}
{"sheet":"Template9090","index":2,"n_rows":104,"n_cols":6,"rows_kept":104,"cut":false,"hidden":true,"merged":[]}
[]
[]
[]
["Report Status: AWAITING GRANTEE CERTIFICATION as of   09/29/2013, 10:53 AM"]
["Performance Items","Program group","Current Quarter",null,"Cumulative"]
["(Time Period to Cumulate Performance Results)",null,"(most recent)",null,"4-Quarter"]
[null,null,null,null,"Reporting Period"]
[null,null,"Value","Numerator","Value","Numerator"]
[null,null,null,"Denominator",null,"Denominator"]
["Total Participants","Total Adult Participants","CUR_PTCPNT_ALADLT",null,"ROL_PTCPNT_ALADLT"]
{"$rows_left_out":95}
{"sheet":"Map9090","index":3,"n_rows":109,"n_cols":19,"rows_kept":109,"cut":false,"hidden":true,"merged":[[108,9,108,18],[106,12,107,14],[100,18,101,18],[102,12,103,14],[98,12,99,14],[98,15,99,15],[98,17,99,17],[100,9,107,11],[100,12,101,14],[100,15,101,15],[100,16,101,16],[100,17,101,17],[104,12,105,14],[92,9,99,11],[92,12,93,14],[92,15,93,15],[92,17,93,17],[94,12,95,14],[94,15,95,15],[94,17,95,17],[96,12,97,14],[96,15,97,15],[96,17,97,17],[88,12,89,14],[88,15,89,15],[88,17,89,17],[90,12,91,14],[90,15,91,15],[90,17,91,17],[82,9,91,11],[82,12,83,14],[82,15,83,15],[82,17,83,17],[84,12,85,14],[84,15,85,15],[84,17,85,17],[86,12,87,14],[86,15,87,15],[86,17,87,17],[70,9,81,11],[70,12,71,14],[70,15,71,15],[70,17,71,17],[72,12,73,14],[72,15,73,15],[72,17,73,17],[78,12,79,14],[78,15,79,15],[78,17,79,17],[80,12,81,14],[80,15,81,15],[80,17,81,17],[74,12,75,14],[74,15,75,15],[74,17,75,17],[76,12,77,14],[76,15,77,15],[76,17,77,17],[64,9,69,11],[64,12,65,14],[64,15,65,15],[64,17,65,17],[66,12,67,14],[66,15,67,15],[66,17,67,17],[68,12,69,14],[68,15,69,15],[68,17,69,17],[56,17,57,17],[58,12,59,14],[58,15,59,15],[58,17,59,17],[60,12,61,14],[60,15,61,15],[60,17,61,17],[52,9,53,11],[52,12,53,14],[52,15,53,15],[52,17,53,17],[54,9,63,11],[54,12,55,14],[54,15,55,15],[54,17,55,17],[56,12,57,14],[56,15,57,15],[62,12,63,14],[62,15,63,15],[62,17,63,17],[48,9,49,11],[48,12,49,14],[48,15,49,15],[48,17,49,17],[50,9,51,11],[50,12,51,14],[50,15,51,15],[50,17,51,17],[44,9,45,11],[44,12,45,14],[44,15,45,15],[44,17,45,17],[46,9,47,11],[46,12,47,14],[46,15,47,15],[46,17,47,17],[41,15,41,16],[41,17,41,18],[42,15,43,15],[42,17,43,17],[34,12,34,14],[35,12,35,14],[36,12,36,14],[37,12,37,14],[38,12,38,14],[39,12,39,14],[27,9,40,11],[27,12,27,14],[28,12,28,14],[29,12,29,14],[30,12,30,14],[31,12,31,14],[32,12,32,14],[33,12,33,14],[41,9,43,11],[41,12,43,14],[20,12,20,14],[22,12,22,14],[23,12,23,14],[24,12,24,14],[9,9,26,11],[9,12,9,14],[10,12,10,14],[11,12,11,14],[12,12,12,14],[13,12,13,14],[14,12,14,14],[15,12,15,14],[16,12,16,14],[17,12,17,14],[25,12,25,14],[26,12,26,14],[5,9,5,18],[6,9,8,11],[6,12,8,14],[6,15,6,16],[6,17,6,18],[7,15,8,15],[7,17,8,17],[18,12,18,14],[19,12,19,14]]}
["Report Status: AWAITING GRANTEE CERTIFICATION as of   09/29/2013, 10:53 AM",null,null,null,null,null,null,null,null,"Report Due Date:",null,"2006-02-14","mm/dd/yyyy",null,null,null,null,"OMB No.","1205-0420"]
["Performance Items","Program group","Current Quarter",null,"Cumulative",null,null,null,null,"Report Quarter End Date:",null,"2005-12-31","mm/dd/yyyy",null,null,null,null,"Expires: 12/31/2012"]
["(Time Period to Cumulate Performance Results)",null,"(most recent)",null,"4-Quarter"]
[null,null,null,null,"Reporting Period"]
[null,null,"Value","Numerator","Value","Numerator"]
[null,null,null,"Denominator",null,"Denominator",null,null,null,"Quarterly Report Form - ETA 9090"]
["Total Participants","Total Adult Participants",null,null,null,null,null,null,null,"Performance Items\n",null,null,"Program Group",null,null,"Current Quarter  (most recent)",null,"Cumulative\n4-Quarter Reporting  Period"]
["(07/01/12 to 06/30/13) ","    Total Adults (self-services only)",null,null,null,null,null,null,null,null,null,null,null,null,null,"Value","Numerator","Value","Numerator"]
[null,"    WIA Adults",null,null,null,null,null,null,null,null,null,null,null,null,null,null,"Denominator",null,"Denominator"]
[null,"    WIA Dislocated Workers",null,null,null,null,null,{"$f":"TRIM(M10)=TRIM(B7)","v":true},null,"  Total Participants\n",null,null,"  Total Adult Participants",null,null,{"$f":"MATCH(Template9090!C10,ByWIB!$1:$1,0)","v":4},null,{"$f":"MATCH(Template9090!E10,ByWIB!$1:$1,0)","v":5}]
{"$rows_left_out":100}
{"sheet":"ByWIB","index":4,"n_rows":28,"n_cols":186,"rows_kept":28,"cut":false,"hidden":true,"merged":[]}
["WIB_NAME","STATE_NAME","RPT_QTR_ID","CUR_PTCPNT_ALADLT","ROL_PTCPNT_ALADLT","CUR_PTCPNT_JSTSLF","ROL_PTCPNT_JSTSLF","CUR_PTCPNT_WIADLT","ROL_PTCPNT_WIADLT","CUR_PTCPNT_DISLOC","ROL_PTCPNT_DISLOC","CUR_PTCPNT_NATLEG","ROL_PTCPNT_NATLEG","CUR_PTCPNT_VETRAN","ROL_PTCPNT_VETRAN","CUR_PTCPNT_VET911","ROL_PTCPNT_VET911","CUR_PTCPNT_VETSVC","ROL_PTCPNT_VETSVC","CUR_PTCPNT_VETTAP","ROL_PTCPNT_VETTAP","CUR_PTCPNT_TRNSVC","ROL_PTCPNT_TRNSVC","CUR_PTCPNT_TRNADT","ROL_PTCPNT_TRNADT","CUR_PTCPNT_TRNDIS","ROL_PTCPNT_TRNDIS","CUR_PTCPNT_TRNNEG","ROL_PTCPNT_TRNNEG","CUR_PTCPNT_TYOUTH","ROL_PTCPNT_TYOUTH","CUR_PTCPNT_YNGYUT","ROL_PTCPNT_YNGYUT","CUR_PTCPNT_OLDYUT","ROL_PTCPNT_OLDYUT","CUR_PTCPNT_OTSCHL","ROL_PTCPNT_OTSCHL","CUR_PTCPNT_INSCHL","ROL_PTCPNT_INSCHL","CUR_EXITER_ALADLT","ROL_EXITER_ALADLT","CUR_EXITER_JSTSLF","ROL_EXITER_JSTSLF","CUR_EXITER_WIADLT","ROL_EXITER_WIADLT","CUR_EXITER_DISLOC","ROL_EXITER_DISLOC","CUR_EXITER_NATLEG","ROL_EXITER_NATLEG","CUR_EXITER_TYOUTH","ROL_EXITER_TYOUTH","CUR_EXITER_YNGYUT","ROL_EXITER_YNGYUT","CUR_EXITER_OLDYUT","ROL_EXITER_OLDYUT","CUR_EXITER_OTSCHL","ROL_EXITER_OTSCHL","CUR_EXITER_INSCHL","ROL_EXITER_INSCHL","CUR_EXITER_TRNSVC","ROL_EXITER_TRNSVC","CUR_EXITER_TRNADT","ROL_EXITER_TRNADT","CUR_EXITER_TRNDIS","ROL_EXITER_TRNDIS","CUR_EXITER_TRNNEG","ROL_EXITER_TRNNEG","CUR_TYOUTH_PLC_NUM","ROL_TYOUTH_PLC_NUM","CUR_TYOUTH_PLC_DEN","ROL_TYOUTH_PLC_DEN","CUR_TYOUTH_ADC_NUM","ROL_TYOUTH_ADC_NUM","CUR_TYOUTH_ADC_DEN","ROL_TYOUTH_ADC_DEN","CUR_TYOUTH_LIT_NUM","ROL_TYOUTH_LIT_NUM","CUR_TYOUTH_LIT_DEN","ROL_TYOUTH_LIT_DEN","CUR_YNGYUT_DER_NUM","ROL_YNGYUT_DER_NUM","CUR_YNGYUT_DER_DEN","ROL_YNGYUT_DER_DEN","CUR_YNGYUT_SAR_NUM","ROL_YNGYUT_SAR_NUM","CUR_YNGYUT_SAR_DEN","ROL_YNGYUT_SAR_DEN","CUR_WIADLT_EER_NUM","ROL_WIADLT_EER_NUM","CUR_WIADLT_EER_DEN","ROL_WIADLT_EER_DEN","CUR_DISLOC_EER_NUM","ROL_DISLOC_EER_NUM","CUR_DISLOC_EER_DEN","ROL_DISLOC_EER_DEN","CUR_VETRAN_EER_NUM","ROL_VETRAN_EER_NUM","CUR_VETRAN_EER_DEN","ROL_VETRAN_EER_DEN","CUR_OLDYUT_EER_NUM","ROL_OLDYUT_EER_NUM","CUR_OLDYUT_EER_DEN","ROL_OLDYUT_EER_DEN","CUR_NATLEG_EER_NUM","ROL_NATLEG_EER_NUM","CUR_NATLEG_EER_DEN","ROL_NATLEG_EER_DEN","CUR_WIADLT_ECR_NUM","ROL_WIADLT_ECR_NUM","CUR_WIADLT_ECR_DEN","ROL_WIADLT_ECR_DEN","CUR_DISLOC_ECR_NUM","ROL_DISLOC_ECR_NUM","CUR_DISLOC_ECR_DEN","ROL_DISLOC_ECR_DEN","CUR_OLDYUT_ECR_NUM","ROL_OLDYUT_ECR_NUM","CUR_OLDYUT_ECR_DEN","ROL_OLDYUT_ECR_DEN","CUR_WIADLT_RET_NUM","ROL_WIADLT_RET_NUM","CUR_WIADLT_RET_DEN","ROL_WIADLT_RET_DEN","CUR_DISLOC_RET_NUM","ROL_DISLOC_RET_NUM","CUR_DISLOC_RET_DEN","ROL_DISLOC_RET_DEN","CUR_VETRAN_RET_NUM","ROL_VETRAN_RET_NUM","CUR_VETRAN_RET_DEN","ROL_VETRAN_RET_DEN","CUR_OLDYUT_RET_NUM","ROL_OLDYUT_RET_NUM","CUR_OLDYUT_RET_DEN","ROL_OLDYUT_RET_DEN","CUR_YNGYUT_RET_NUM","ROL_YNGYUT_RET_NUM","CUR_YNGYUT_RET_DEN","ROL_YNGYUT_RET_DEN","CUR_NATLEG_RET_NUM","ROL_NATLEG_RET_NUM","CUR_NATLEG_RET_DEN","ROL_NATLEG_RET_DEN","CUR_WIADLT_AVG_NUM","ROL_WIADLT_AVG_NUM","CUR_WIADLT_AVG_DEN","ROL_WIADLT_AVG_DEN","CUR_DISLOC_AVG_NUM","ROL_DISLOC_AVG_NUM","CUR_DISLOC_AVG_DEN","ROL_DISLOC_AVG_DEN","CUR_VETRAN_AVG_NUM","ROL_VETRAN_AVG_NUM","CUR_VETRAN_AVG_DEN","ROL_VETRAN_AVG_DEN","CUR_OLDYUT_AVG_NUM","ROL_OLDYUT_AVG_NUM","CUR_OLDYUT_AVG_DEN","ROL_OLDYUT_AVG_DEN","CUR_NATLEG_AVG_NUM","ROL_NATLEG_AVG_NUM","CUR_NATLEG_AVG_DEN","ROL_NATLEG_AVG_DEN","CUR_WIADLT_CAR_NUM","ROL_WIADLT_CAR_NUM","CUR_WIADLT_CAR_DEN","ROL_WIADLT_CAR_DEN","CUR_DISLOC_CAR_NUM","ROL_DISLOC_CAR_NUM","CUR_DISLOC_CAR_DEN","ROL_DISLOC_CAR_DEN","CUR_TYOUTH_CAR_NUM","ROL_TYOUTH_CAR_NUM","CUR_TYOUTH_CAR_DEN","ROL_TYOUTH_CAR_DEN","CUR_NATLEG_CAR_NUM","ROL_NATLEG_CAR_NUM","CUR_NATLEG_CAR_DEN","ROL_NATLEG_CAR_DEN","CUR_REACHD","ROL_REACHD","CUR_SERVCD","ROL_SERVCD","CUR_STAFSV","ROL_STAFSV","FILEIMPORTLOGID"]
["01 - CareerSource Escarosa","FL",20141231,616,839,null,null,511,685,108,160,1,2,68,93,34,38,32,36,null,null,331,527,269,425,63,105,null,1,260,343,216,281,44,62,102,125,158,218,92,282,null,null,74,228,18,58,null,1,41,116,37,90,4,26,5,42,36,74,90,268,72,215,18,57,null,1,14,122,17,147,17,122,19,151,6,23,10,51,20,44,31,63,50,268,75,341,28,80,28,95,16,49,18,54,4,14,4,17,6,22,7,27,null,null,null,null,47,131,50,154,14,45,18,54,5,19,7,33,30,111,36,122,15,65,16,71,8,18,10,23,9,18,9,20,54,102,60,127,null,2,null,3,391884,1253045,26,90,193006,734986,14,51,62559,143563,5,11,48911,85777,8,18,null,18045,null,1,47,138,50,154,16,49,18,54,2,14,2,14,null,null,null,null,9,28,9,28,9,28,11384]
["02 - CareerSource Okaloosa Walton ","FL",20141231,183,265,null,null,145,207,44,65,2,2,17,22,4,4,2,4,1,1,114,214,93,178,25,43,1,2,76,110,64,90,12,20,23,33,53,77,40,98,null,null,32,76,8,24,null,null,17,44,13,36,4,8,4,14,13,30,38,94,31,74,7,22,null,null,8,43,8,52,8,41,9,51,0,2,1,15,8,26,12,33,7,51,16,67,7,38,7,40,7,33,7,33,2,16,2,16,1,2,1,5,null,2,null,2,7,99,8,108,7,27,7,33,1,2,2,7,20,115,22,119,13,37,15,41,7,23,8,24,null,7,null,7,12,43,14,48,1,5,1,6,258279,1752658,15,95,121864,386013,10,28,90242,309491,6,18,null,38982,null,4,11425,57481,1,3,7,100,8,108,7,27,7,33,6,18,7,20,null,1,null,2,1,4,1,4,1,4,11384]
["03 - CareerSource Chipola","FL",20141231,87,126,null,null,72,98,15,28,null,null,6,9,4,6,3,3,null,null,50,87,41,68,9,19,null,null,71,99,31,46,40,53,69,94,2,5,13,47,null,null,7,30,6,17,null,null,8,34,5,18,3,16,7,31,1,3,12,44,7,29,5,15,null,null,4,20,5,26,6,26,6,31,4,13,6,23,4,11,4,16,1,18,3,21,7,24,8,27,2,11,2,11,2,3,2,3,3,12,3,12,null,null,null,null,9,33,11,39,2,8,2,10,4,13,5,18,10,40,12,46,3,10,3,10,null,1,null,1,6,13,6,14,3,9,4,17,null,null,null,null,146941,481677,9,37,15624,62209,1,6,null,14525,null,1,32458,88985,4,12,null,null,null,null,9,34,11,39,2,8,2,10,4,13,4,16,null,null,null,null,1,4,1,4,1,4,11384]
["04 - CareerSource Gulf Coast","FL",20141231,347,598,null,null,292,501,65,116,31,73,34,61,23,40,12,17,7,11,210,347,173,272,42,90,17,60,204,235,194,221,10,14,7,9,197,226,79,336,null,null,72,276,8,70,4,55,7,53,6,49,1,4,null,2,7,51,34,181,29,130,6,61,4,54,17,53,19,62,19,52,21,65,0,1,0,1,4,43,4,43,36,165,36,165,61,272,63,289,24,92,26,100,11,45,11,46,null,1,null,1,24,80,26,88,36,123,38,140,23,78,25,88,null,1,2,3,92,264,99,286,22,75,25,84,12,34,14,38,1,1,1,1,9,34,9,47,19,53,21,60,1579480,4155549,86,228,348068,1129345,20,65,256119,612969,12,29,9673,9673,1,1,315993,859264,18,50,37,129,38,140,25,83,25,88,1,3,3,5,26,79,26,86,18,39,18,39,18,39,11384]
["05 - CareerSource Capital Region","FL",20141231,702,1088,null,null,440,666,270,439,null,null,27,50,8,14,5,10,null,null,232,452,208,385,26,72,null,null,563,730,293,367,270,363,336,450,227,280,164,465,null,null,93,273,71,204,null,null,70,206,31,89,39,117,48,136,22,70,81,227,69,190,12,43,null,null,10,34,17,54,14,53,16,61,16,49,39,145,18,37,23,62,23,112,54,273,29,91,30,96,20,81,23,93,1,7,1,7,3,18,7,30,null,null,null,null,35,104,37,110,6,25,7,29,3,18,10,44,26,122,27,127,15,75,15,80,2,12,2,13,6,16,6,17,4,7,5,13,null,1,null,1,438629,2051017,24,111,188824,1114852,13,68,25085,202169,2,12,35239,105524,5,14,null,16966,null,1,36,105,37,110,7,26,7,29,4,19,4,20,null,null,null,null,1,20,1,20,1,20,11384]
["06 - CareerSource North Florida","FL",20141231,140,216,null,null,118,188,24,30,null,null,14,18,7,9,1,7,null,null,95,185,84,166,11,21,null,null,92,126,57,82,35,44,52,65,40,61,33,97,null,null,33,89,null,9,null,null,15,37,14,27,1,10,4,14,11,23,31,90,31,84,null,7,null,null,6,14,9,23,6,12,8,23,0,7,4,27,10,15,13,23,2,12,4,39,6,12,6,15,3,7,3,8,null,null,null,null,null,2,2,8,null,null,null,null,9,103,12,110,1,3,2,6,null,1,2,8,14,105,14,108,null,1,null,2,null,2,null,2,1,1,1,1,5,10,6,11,null,null,null,null,203302,1922762,14,104,null,null,null,null,null,45090,null,2,10198,10198,1,1,null,null,null,null,9,103,12,110,1,3,2,6,2,6,2,7,null,null,null,null,null,8,null,8,null,8,11384]
["07 - CareerSource Florida Crown","FL",20141231,90,136,null,null,79,120,11,17,null,null,8,14,5,8,5,8,null,null,66,110,61,99,5,11,null,null,143,176,119,148,24,28,77,94,66,82,16,124,null,null,12,102,4,23,null,null,20,90,19,60,1,30,7,61,13,29,14,115,11,95,3,21,null,null,4,47,7,95,7,48,8,100,2,11,2,16,18,31,18,56,31,166,31,167,4,19,4,30,1,11,1,20,null,2,null,3,2,11,2,29,null,null,null,null,16,54,17,84,1,8,1,18,2,5,2,33,8,33,8,35,1,15,1,15,null,1,null,1,null,6,null,6,11,30,18,49,null,null,null,null,142590,554346,8,29,31118,225992,1,12,null,null,null,null,null,27629,null,5,null,null,null,null,16,60,17,84,1,12,1,18,null,2,null,4,null,null,null,null,5,8,5,8,5,8,11384]
["08 - CareerSource Northeast Florida","FL",20141231,1952,3462,null,null,1714,2948,254,547,5,16,129,279,53,96,50,92,2,7,1408,2624,1266,2333,147,302,1,7,600,1099,477,881,123,218,183,334,417,765,273,1802,null,null,210,1475,64,350,null,11,97,540,78,429,19,111,29,174,68,366,273,1796,210,1471,64,348,null,11,20,162,32,329,31,276,46,378,27,94,49,164,22,218,26,271,82,673,115,748,66,239,83,293,87,263,106,320,21,60,24,77,4,35,6,61,1,3,1,6,250,1079,312,1239,74,235,112,333,11,41,15,90,237,994,254,1057,53,256,63,278,24,101,26,105,8,51,8,59,36,120,50,196,null,7,null,7,4521636,20078791,234,967,894799,3914745,52,233,368165,1728424,23,94,41845,235953,8,55,null,55552,null,5,266,1149,312,1239,89,276,112,333,15,114,18,128,2,6,2,7,27,110,27,110,27,110,11384]
["09 - CareerSource North Central","FL",20141231,538,717,null,null,428,581,120,150,14,14,65,78,10,13,6,10,null,null,140,293,113,247,29,48,14,14,289,384,215,285,74,99,116,156,173,228,74,222,null,null,67,189,8,37,null,null,38,120,30,90,8,30,14,50,24,70,65,183,59,152,6,34,null,null,11,62,16,92,10,58,16,86,8,27,14,63,20,45,23,60,21,84,53,214,24,72,24,85,11,31,12,39,3,6,3,7,2,16,4,20,null,null,null,null,20,78,31,111,8,24,11,32,1,6,4,21,37,73,40,82,6,18,6,19,4,10,4,10,7,14,9,22,10,34,14,64,null,null,null,null,611158,1165137,33,63,110127,336085,6,17,37427,164074,3,9,34340,80319,9,22,null,null,null,null,20,87,31,111,9,29,11,32,6,34,7,35,null,null,null,null,null,14,null,14,null,14,11384]
{"$rows_left_out":19}
{"sheet":"ByState","index":5,"n_rows":2,"n_cols":186,"rows_kept":2,"cut":false,"hidden":true,"merged":[]}
["WIB_NAME","STATE_NAME","RPT_QTR_ID","CUR_PTCPNT_ALADLT","ROL_PTCPNT_ALADLT","CUR_PTCPNT_JSTSLF","ROL_PTCPNT_JSTSLF","CUR_PTCPNT_WIADLT","ROL_PTCPNT_WIADLT","CUR_PTCPNT_DISLOC","ROL_PTCPNT_DISLOC","CUR_PTCPNT_NATLEG","ROL_PTCPNT_NATLEG","CUR_PTCPNT_VETRAN","ROL_PTCPNT_VETRAN","CUR_PTCPNT_VET911","ROL_PTCPNT_VET911","CUR_PTCPNT_VETSVC","ROL_PTCPNT_VETSVC","CUR_PTCPNT_VETTAP","ROL_PTCPNT_VETTAP","CUR_PTCPNT_TRNSVC","ROL_PTCPNT_TRNSVC","CUR_PTCPNT_TRNADT","ROL_PTCPNT_TRNADT","CUR_PTCPNT_TRNDIS","ROL_PTCPNT_TRNDIS","CUR_PTCPNT_TRNNEG","ROL_PTCPNT_TRNNEG","CUR_PTCPNT_TYOUTH","ROL_PTCPNT_TYOUTH","CUR_PTCPNT_YNGYUT","ROL_PTCPNT_YNGYUT","CUR_PTCPNT_OLDYUT","ROL_PTCPNT_OLDYUT","CUR_PTCPNT_OTSCHL","ROL_PTCPNT_OTSCHL","CUR_PTCPNT_INSCHL","ROL_PTCPNT_INSCHL","CUR_EXITER_ALADLT","ROL_EXITER_ALADLT","CUR_EXITER_JSTSLF","ROL_EXITER_JSTSLF","CUR_EXITER_WIADLT","ROL_EXITER_WIADLT","CUR_EXITER_DISLOC","ROL_EXITER_DISLOC","CUR_EXITER_NATLEG","ROL_EXITER_NATLEG","CUR_EXITER_TYOUTH","ROL_EXITER_TYOUTH","CUR_EXITER_YNGYUT","ROL_EXITER_YNGYUT","CUR_EXITER_OLDYUT","ROL_EXITER_OLDYUT","CUR_EXITER_OTSCHL","ROL_EXITER_OTSCHL","CUR_EXITER_INSCHL","ROL_EXITER_INSCHL","CUR_EXITER_TRNSVC","ROL_EXITER_TRNSVC","CUR_EXITER_TRNADT","ROL_EXITER_TRNADT","CUR_EXITER_TRNDIS","ROL_EXITER_TRNDIS","CUR_EXITER_TRNNEG","ROL_EXITER_TRNNEG","CUR_TYOUTH_PLC_NUM","ROL_TYOUTH_PLC_NUM","CUR_TYOUTH_PLC_DEN","ROL_TYOUTH_PLC_DEN","CUR_TYOUTH_ADC_NUM","ROL_TYOUTH_ADC_NUM","CUR_TYOUTH_ADC_DEN","ROL_TYOUTH_ADC_DEN","CUR_TYOUTH_LIT_NUM","ROL_TYOUTH_LIT_NUM","CUR_TYOUTH_LIT_DEN","ROL_TYOUTH_LIT_DEN","CUR_YNGYUT_DER_NUM","ROL_YNGYUT_DER_NUM","CUR_YNGYUT_DER_DEN","ROL_YNGYUT_DER_DEN","CUR_YNGYUT_SAR_NUM","ROL_YNGYUT_SAR_NUM","CUR_YNGYUT_SAR_DEN","ROL_YNGYUT_SAR_DEN","CUR_WIADLT_EER_NUM","ROL_WIADLT_EER_NUM","CUR_WIADLT_EER_DEN","ROL_WIADLT_EER_DEN","CUR_DISLOC_EER_NUM","ROL_DISLOC_EER_NUM","CUR_DISLOC_EER_DEN","ROL_DISLOC_EER_DEN","CUR_VETRAN_EER_NUM","ROL_VETRAN_EER_NUM","CUR_VETRAN_EER_DEN","ROL_VETRAN_EER_DEN","CUR_OLDYUT_EER_NUM","ROL_OLDYUT_EER_NUM","CUR_OLDYUT_EER_DEN","ROL_OLDYUT_EER_DEN","CUR_NATLEG_EER_NUM","ROL_NATLEG_EER_NUM","CUR_NATLEG_EER_DEN","ROL_NATLEG_EER_DEN","CUR_WIADLT_ECR_NUM","ROL_WIADLT_ECR_NUM","CUR_WIADLT_ECR_DEN","ROL_WIADLT_ECR_DEN","CUR_DISLOC_ECR_NUM","ROL_DISLOC_ECR_NUM","CUR_DISLOC_ECR_DEN","ROL_DISLOC_ECR_DEN","CUR_OLDYUT_ECR_NUM","ROL_OLDYUT_ECR_NUM","CUR_OLDYUT_ECR_DEN","ROL_OLDYUT_ECR_DEN","CUR_WIADLT_RET_NUM","ROL_WIADLT_RET_NUM","CUR_WIADLT_RET_DEN","ROL_WIADLT_RET_DEN","CUR_DISLOC_RET_NUM","ROL_DISLOC_RET_NUM","CUR_DISLOC_RET_DEN","ROL_DISLOC_RET_DEN","CUR_VETRAN_RET_NUM","ROL_VETRAN_RET_NUM","CUR_VETRAN_RET_DEN","ROL_VETRAN_RET_DEN","CUR_OLDYUT_RET_NUM","ROL_OLDYUT_RET_NUM","CUR_OLDYUT_RET_DEN","ROL_OLDYUT_RET_DEN","CUR_YNGYUT_RET_NUM","ROL_YNGYUT_RET_NUM","CUR_YNGYUT_RET_DEN","ROL_YNGYUT_RET_DEN","CUR_NATLEG_RET_NUM","ROL_NATLEG_RET_NUM","CUR_NATLEG_RET_DEN","ROL_NATLEG_RET_DEN","CUR_WIADLT_AVG_NUM","ROL_WIADLT_AVG_NUM","CUR_WIADLT_AVG_DEN","ROL_WIADLT_AVG_DEN","CUR_DISLOC_AVG_NUM","ROL_DISLOC_AVG_NUM","CUR_DISLOC_AVG_DEN","ROL_DISLOC_AVG_DEN","CUR_VETRAN_AVG_NUM","ROL_VETRAN_AVG_NUM","CUR_VETRAN_AVG_DEN","ROL_VETRAN_AVG_DEN","CUR_OLDYUT_AVG_NUM","ROL_OLDYUT_AVG_NUM","CUR_OLDYUT_AVG_DEN","ROL_OLDYUT_AVG_DEN","CUR_NATLEG_AVG_NUM","ROL_NATLEG_AVG_NUM","CUR_NATLEG_AVG_DEN","ROL_NATLEG_AVG_DEN","CUR_WIADLT_CAR_NUM","ROL_WIADLT_CAR_NUM","CUR_WIADLT_CAR_DEN","ROL_WIADLT_CAR_DEN","CUR_DISLOC_CAR_NUM","ROL_DISLOC_CAR_NUM","CUR_DISLOC_CAR_DEN","ROL_DISLOC_CAR_DEN","CUR_TYOUTH_CAR_NUM","ROL_TYOUTH_CAR_NUM","CUR_TYOUTH_CAR_DEN","ROL_TYOUTH_CAR_DEN","CUR_NATLEG_CAR_NUM","ROL_NATLEG_CAR_NUM","CUR_NATLEG_CAR_DEN","ROL_NATLEG_CAR_DEN","CUR_REACHD","ROL_REACHD","CUR_SERVCD","ROL_SERVCD","CUR_STAFSV","ROL_STAFSV","FILEIMPORTLOGID"]
["State","FL",20141231,27185,43310,1,1,18735,29435,8313,13178,771,1784,2067,3284,559,831,423,718,41,54,12197,23873,9019,17577,3160,6202,281,664,11613,15371,7652,9790,3961,5581,5718,7879,5894,7490,3929,20777,null,null,2380,13661,1362,6303,286,1407,1182,4882,726,2758,456,2124,588,2875,594,2006,3010,16490,1929,11408,1047,4977,113,584,538,3115,715,4407,572,3230,757,4259,424,1712,775,3121,423,1443,538,2001,1555,7899,1980,9560,1259,4940,1438,6231,1348,5360,1523,6308,226,940,263,1200,271,1310,357,1803,251,1103,306,1685,1780,8931,2396,11192,741,3034,1246,5044,213,903,436,2091,2543,11444,2786,12569,1245,5556,1383,6186,279,1163,311,1296,300,1235,357,1458,643,1744,790,2378,234,947,267,1056,45161585,195665592,2391,10721,18554811,78610889,1127,4955,4836986,19219056,252,1028,1392066,5807501,307,1261,4618385,18410500,208,822,1901,9609,2400,11196,834,3492,1246,5044,325,1575,369,1758,76,321,144,693,260,1124,260,1124,260,1124,11384]

{"sheet":"ETA9090","index":6,"n_rows":108,"n_cols":18,"rows_kept":108,"cut":false,"hidden":false,"merged":[[101,16,102,16],[103,10,104,12],[105,10,106,12],[107,10,108,12],[103,14,104,14],[105,14,106,14],[107,14,108,14],[103,16,104,16],[105,16,106,16],[107,16,108,16],[99,10,100,12],[99,13,100,13],[99,15,100,15],[101,7,108,9],[101,10,102,12],[101,13,102,13],[101,14,102,14],[101,15,102,15],[93,7,100,9],[93,10,94,12],[93,13,94,13],[93,15,94,15],[95,10,96,12],[95,13,96,13],[95,15,96,15],[97,10,98,12],[97,13,98,13],[97,15,98,15],[105,13,106,13],[107,13,108,13],[105,15,106,15],[107,15,108,15],[89,10,90,12],[89,13,90,13],[89,15,90,15],[91,10,92,12],[91,13,92,13],[91,15,92,15],[83,7,92,9],[83,10,84,12],[83,13,84,13],[83,15,84,15],[85,10,86,12],[85,13,86,13],[85,15,86,15],[87,10,88,12],[87,13,88,13],[87,15,88,15],[71,7,82,9],[71,10,72,12],[71,13,72,13],[71,15,72,15],[73,10,74,12],[73,13,74,13],[73,15,74,15],[79,10,80,12],[79,13,80,13],[79,15,80,15],[81,10,82,12],[81,13,82,13],[81,15,82,15],[75,10,76,12],[75,13,76,13],[75,15,76,15],[77,10,78,12],[77,13,78,13],[77,15,78,15],[65,7,70,9],[65,10,66,12],[65,13,66,13],[65,15,66,15],[67,10,68,12],[67,13,68,13],[67,15,68,15],[69,10,70,12],[69,13,70,13],[69,15,70,15],[57,15,58,15],[59,10,60,12],[59,13,60,13],[59,15,60,15],[61,10,62,12],[61,13,62,13],[61,15,62,15],[53,7,54,9],[53,10,54,12],[53,13,54,13],[53,15,54,15],[55,7,64,9],[55,10,56,12],[55,13,56,13],[55,15,56,15],[57,10,58,12],[57,13,58,13],[63,10,64,12],[63,13,64,13],[63,15,64,15],[49,7,50,9],[49,10,50,12],[49,13,50,13],[49,15,50,15],[51,7,52,9],[51,10,52,12],[51,13,52,13],[51,15,52,15],[45,7,46,9],[45,10,46,12],[45,13,46,13],[45,15,46,15],[47,7,48,9],[47,10,48,12],[47,13,48,13],[47,15,48,15],[42,13,42,14],[42,15,42,16],[43,13,44,13],[43,15,44,15],[35,10,35,12],[36,10,36,12],[37,10,37,12],[38,10,38,12],[39,10,39,12],[40,10,40,12],[28,7,41,9],[28,10,28,12],[29,10,29,12],[30,10,30,12],[31,10,31,12],[32,10,32,12],[33,10,33,12],[34,10,34,12],[42,7,44,9],[42,10,44,12],[20,10,20,12],[21,10,21,12],[23,10,23,12],[24,10,24,12],[25,10,25,12],[10,7,27,9],[10,10,10,12],[11,10,11,12],[12,10,12,12],[13,10,13,12],[14,10,14,12],[15,10,15,12],[16,10,16,12],[17,10,17,12],[18,10,18,12],[26,10,26,12],[27,10,27,12],[6,7,6,16],[7,7,9,9],[7,10,9,12],[7,13,7,14],[7,15,7,16],[8,13,9,13],[8,15,9,15],[2,7,2,16],[19,10,19,12],[3,7,3,16],[4,7,4,16]]}
[null,null,null,null,null,null,null,null,null,null,null,null,null,null,null,null,{"$f":"\"Version: \"&MAX(Version!A:A)","v":"Version: 2"}]
["ByState",2,null,null,null,null,null,null,null,null,null,null,null,null,null,null,"Data as of 3/19/2015"]
[null,null,null,null,null,null,null,{"$f":"\"Report Quarter: \"&R3","v":"Report Quarter: 20141231"},null,null,null,null,null,null,null,null,null,20141231]
[null,null,null,"01 - CareerSource Escarosa",null,null,null,{"$f":"\"State: \"&R4","v":"State: FL"},null,null,null,null,null,null,null,null,null,"FL"]
[null,null,null,"02 - CareerSource Okaloosa Walton ",null,null,null,{"$f":"IF(A2=\"ByWIB\",\"WIB: \"&A3,\"\")","v":""}]
[null,null,null,"03 - CareerSource Chipola"]
[null,null,null,"04 - CareerSource Gulf Coast",null,null,null,"Quarterly Report Form - ETA 9090"]
[null,null,null,"05 - CareerSource Capital Region",null,null,null,"Performance Items\n",null,null,"Program Group",null,null,"Current Quarter  (most recent)",null,"Cumulative\n4-Quarter Reporting  Period"]
[null,null,null,"06 - CareerSource North Florida",null,null,null,null,null,null,null,null,null,"Value","Numerator","Value","Numerator"]
[null,null,null,"07 - CareerSource Florida Crown",null,null,null,null,null,null,null,null,null,null,"Denominator",null,"Denominator"]
{"$rows_left_out":98}